Reaction Details
TargetProtein-glutamine gamma-glutamyltransferase 2
LigandBDBM50400618
Substrate/Competitorn/a
Meas. Tech.ChEMBL_1669694 (CHEMBL4019582)
Ki 60300±n/a nM
Citation Akbar, AMcNeil, NMRAlbert, MRTa, VAdhikary, GBourgeois, KEckert, RLKeillor, JW Structure-Activity Relationships of Potent, Targeted Covalent Inhibitors That Abolish Both the Transamidation and GTP Binding Activities of Human Tissue Transglutaminase. J Med Chem60:7910-7927 (2017) 
 
Protein-glutamine gamma-glutamyltransferase 2
Name:Protein-glutamine gamma-glutamyltransferase 2
Type:Protein
Mol. Mass.:77309.30
Organism:Homo sapiens (Human)
Description:P21980
Residue:687
BDBM50400618
NameBDBM50400618
Synonyms:CHEMBL2203477
TypeSmall organic molecule
Emp. Form.C17H22N2O5
Mol. Mass.334.367
SMILESOC(=O)[C@H](CCCCNC(=O)C=C)NC(=O)OCc1ccccc1