Reaction Details
TargetProtein-glutamine gamma-glutamyltransferase 2
LigandBDBM50241227
Substrate/Competitorn/a
Meas. Tech.ChEMBL_1669694 (CHEMBL4019582)
Ki 40100±n/a nM
Citation Akbar, AMcNeil, NMRAlbert, MRTa, VAdhikary, GBourgeois, KEckert, RLKeillor, JW Structure-Activity Relationships of Potent, Targeted Covalent Inhibitors That Abolish Both the Transamidation and GTP Binding Activities of Human Tissue Transglutaminase. J Med Chem60:7910-7927 (2017) 
 
Protein-glutamine gamma-glutamyltransferase 2
Name:Protein-glutamine gamma-glutamyltransferase 2
Type:Protein
Mol. Mass.:77309.30
Organism:Homo sapiens (Human)
Description:P21980
Residue:687
BDBM50241227
NameBDBM50241227
Synonyms:CHEMBL4098628
TypeSmall organic molecule
Emp. Form.C25H32N4O6S2
Mol. Mass.548.675
SMILESC=CC(=O)NCCCC[C@H](NC(=O)OCc1ccccc1)C(=O)N1CCN(CC1)S(=O)(=O)c1cccs1