Reaction Details
TargetProtein-glutamine gamma-glutamyltransferase 2
LigandBDBM50241232
Substrate/Competitorn/a
Meas. Tech.ChEMBL_1669694 (CHEMBL4019582)
Ki 23400±n/a nM
Citation Akbar, AMcNeil, NMRAlbert, MRTa, VAdhikary, GBourgeois, KEckert, RLKeillor, JW Structure-Activity Relationships of Potent, Targeted Covalent Inhibitors That Abolish Both the Transamidation and GTP Binding Activities of Human Tissue Transglutaminase. J Med Chem60:7910-7927 (2017) 
 
Protein-glutamine gamma-glutamyltransferase 2
Name:Protein-glutamine gamma-glutamyltransferase 2
Type:Protein
Mol. Mass.:77309.30
Organism:Homo sapiens (Human)
Description:P21980
Residue:687
BDBM50241232
NameBDBM50241232
Synonyms:CHEMBL4097427
TypeSmall organic molecule
Emp. Form.C27H33N5O5
Mol. Mass.507.5814
SMILESC=CC(=O)NCCCC[C@H](NC(=O)OCc1ccccc1)C(=O)N1CCN(CC1)C(=O)c1cccnc1