Reaction Details
TargetProtein-glutamine gamma-glutamyltransferase 2
LigandBDBM50400644
Substrate/Competitorn/a
Meas. Tech.ChEMBL_1669694 (CHEMBL4019582)
Ki 28900±n/a nM
Citation Akbar, AMcNeil, NMRAlbert, MRTa, VAdhikary, GBourgeois, KEckert, RLKeillor, JW Structure-Activity Relationships of Potent, Targeted Covalent Inhibitors That Abolish Both the Transamidation and GTP Binding Activities of Human Tissue Transglutaminase. J Med Chem60:7910-7927 (2017) 
 
Protein-glutamine gamma-glutamyltransferase 2
Name:Protein-glutamine gamma-glutamyltransferase 2
Type:Protein
Mol. Mass.:77309.30
Organism:Homo sapiens (Human)
Description:P21980
Residue:687
BDBM50400644
NameBDBM50400644
Synonyms:CHEMBL2203460
TypeSmall organic molecule
Emp. Form.C21H29N3O5
Mol. Mass.403.4721
SMILESC=CC(=O)NCCCC[C@H](NC(=O)OCc1ccccc1)C(=O)N1CCOCC1