Reaction Details
TargetProtein-glutamine gamma-glutamyltransferase 2
LigandBDBM50241246
Substrate/Competitorn/a
Meas. Tech.ChEMBL_1669702 (CHEMBL4019590)
Ki 47700±n/a nM
Citation Akbar, AMcNeil, NMRAlbert, MRTa, VAdhikary, GBourgeois, KEckert, RLKeillor, JW Structure-Activity Relationships of Potent, Targeted Covalent Inhibitors That Abolish Both the Transamidation and GTP Binding Activities of Human Tissue Transglutaminase. J Med Chem60:7910-7927 (2017) 
 
Protein-glutamine gamma-glutamyltransferase 2
Name:Protein-glutamine gamma-glutamyltransferase 2
Type:Protein
Mol. Mass.:77309.30
Organism:Homo sapiens (Human)
Description:P21980
Residue:687
BDBM50241246
NameBDBM50241246
Synonyms:CHEMBL4089771
TypeSmall organic molecule
Emp. Form.C32H39N5O6S
Mol. Mass.621.747
SMILESCN(C)c1cccc2c(cccc12)S(=O)(=O)N1CCN(CC1)C(=O)[C@H](CCCNC(=O)C=C)NC(=O)OCc1ccccc1