Reaction Details
TargetNicotinamide phosphoribosyltransferase
LigandBDBM50241448
Substrate/Competitorn/a
Meas. Tech.ChEMBL_1669854 (CHEMBL4019742)
IC50 18±n/a nM
Citation Dong, GChen, WWang, XYang, XXu, TWang, PZhang, WRao, YMiao, CSheng, C Small Molecule Inhibitors Simultaneously Targeting Cancer Metabolism and Epigenetics: Discovery of Novel Nicotinamide Phosphoribosyltransferase (NAMPT) and Histone Deacetylase (HDAC) Dual Inhibitors. J Med Chem60:7965-7983 (2017) 
 
Nicotinamide phosphoribosyltransferase
Name:Nicotinamide phosphoribosyltransferase
Type:Enzyme
Mol. Mass.:55524.98
Organism:Homo sapiens (Human)
Description:P43490
Residue:491
BDBM50241448
NameBDBM50241448
Synonyms:CHEMBL4064385
TypeSmall organic molecule
Emp. Form.C29H26N8O2
Mol. Mass.518.5691
SMILESNc1ccccc1NC(=O)c1ccc(Cn2cc(nn2)-c2ccc(NC(=O)NCc3cccnc3)cc2)cc1