Reaction Details
TargetTransient receptor potential cation channel subfamily V member 1
LigandBDBM50241485
Substrate/Competitorn/a
Meas. Tech.ChEMBL_1669891 (CHEMBL4019779)
Kd 0.064000±n/a nM
Citation Pearce, LVAnn, JJung, AThorat, SAHerold, BKAHabtemichael, ADBlumberg, PMLee, J Novel Radiolabeled Vanilloid with Enhanced Specificity for Human Transient Receptor Potential Vanilloid 1 (TRPV1). J Med Chem60:8246-8252 (2017) 
 
Transient receptor potential cation channel subfamily V member 1
Name:Transient receptor potential cation channel subfamily V member 1
Type:Transient Receptor
Mol. Mass.:94956.12
Organism:Rattus norvegicus (rat)
Description:O35433
Residue:838
BDBM50241485
NameBDBM50241485
Synonyms:CHEMBL4060041
TypeSmall organic molecule
Emp. Form.C37H40O9
Mol. Mass.628.7081
SMILES[H][C@]12O[C@@]3(Cc4ccccc4)O[C@]1(C[C@@H](C)[C@]1(O3)[C@]3([H])C=C(C)C(=O)[C@@]3(O)CC(COC(=O)Cc3ccc(O)c(OC)c3)=C[C@]21[H])C(C)=C