Reaction Details
TargetTransient receptor potential cation channel subfamily V member 1
LigandBDBM50398494
Substrate/Competitorn/a
Meas. Tech.ChEMBL_1669893 (CHEMBL4019781)
Ki 3.0±n/a nM
Citation Pearce, LVAnn, JJung, AThorat, SAHerold, BKAHabtemichael, ADBlumberg, PMLee, J Novel Radiolabeled Vanilloid with Enhanced Specificity for Human Transient Receptor Potential Vanilloid 1 (TRPV1). J Med Chem60:8246-8252 (2017) 
 
Transient receptor potential cation channel subfamily V member 1
Name:Transient receptor potential cation channel subfamily V member 1
Type:Protein
Mol. Mass.:94960.75
Organism:Homo sapiens (Human)
Description:Q8NER1
Residue:839
BDBM50398494
NameBDBM50398494
Synonyms:CHEMBL2177429
TypeSmall organic molecule
Emp. Form.C23H28F4N4O3S
Mol. Mass.516.552
SMILESC[C@H](C(=O)NCc1ccc(nc1N1CCC(C)CC1)C(F)(F)F)c1ccc(NS(C)(=O)=O)c(F)c1