Reaction Details
TargetProtein Mdm4
LigandBDBM50241622
Substrate/Competitorn/a
Meas. Tech.ChEMBL_1670059 (CHEMBL4019947)
IC50 140±n/a nM
Citation Giustiniano, MDaniele, SPelliccia, SLa Pietra, VPietrobono, DBrancaccio, DCosconati, SMessere, AGiuntini, SCerofolini, LFragai, MLuchinat, CTaliani, SLa Regina, GDa Settimo, FSilvestri, RMartini, CNovellino, EMarinelli, L Computer-Aided Identification and Lead Optimization of Dual Murine Double Minute 2 and 4 Binders: Structure-Activity Relationship Studies and Pharmacological Activity. J Med Chem60:8115-8130 (2017) 
 
Protein Mdm4
Name:Protein Mdm4
Type:Oncoprotein
Mol. Mass.:54842.04
Organism:Homo sapiens (Human)
Description:The HDMX(1-188) were expressed in Escherichia coli BL21 (DE3) as a GST fusion and purified on glutathione sepharose.
Residue:490
BDBM50241622
NameBDBM50241622
Synonyms:CHEMBL4074577
TypeSmall organic molecule
Emp. Form.C24H23NO3
Mol. Mass.373.4443
SMILESOC(=O)[C@H](Cc1ccccc1)NC(=O)CC(c1ccccc1)c1ccccc1