Reaction Details
TargetPolycomb protein EED
LigandBDBM50241645
Substrate/Competitorn/a
Meas. Tech.ChEMBL_1670151 (CHEMBL4020039)
Ki 12±n/a nM
Citation Wang, YEdalji, RPPanchal, SCSun, CDjuric, SWVasudevan, A Are We There Yet? Applying Thermodynamic and Kinetic Profiling on Embryonic Ectoderm Development (EED) Hit-to-Lead Program. J Med Chem60:8321-8335 (2017) 
 
Polycomb protein EED
Name:Polycomb protein EED
Type:Protein
Mol. Mass.:50201.68
Organism:Homo sapiens (Human)
Description:O75530
Residue:441
BDBM50241645
NameBDBM50241645
Synonyms:CHEMBL4078052
TypeSmall organic molecule
Emp. Form.C22H29FN2O2
Mol. Mass.372.4763
SMILESCOc1ccc(cc1OC)[C@H]1CN(Cc2c(C)cccc2F)C[C@@H]1N(C)C