Reaction Details
TargetPolycomb protein EED
LigandBDBM50235648
Substrate/Competitorn/a
Meas. Tech.ChEMBL_1670151 (CHEMBL4020039)
Ki 3.0±n/a nM
Citation Wang, YEdalji, RPPanchal, SCSun, CDjuric, SWVasudevan, A Are We There Yet? Applying Thermodynamic and Kinetic Profiling on Embryonic Ectoderm Development (EED) Hit-to-Lead Program. J Med Chem60:8321-8335 (2017) 
 
Polycomb protein EED
Name:Polycomb protein EED
Type:Protein
Mol. Mass.:50201.68
Organism:Homo sapiens (Human)
Description:O75530
Residue:441
BDBM50235648
NameBDBM50235648
Synonyms:CHEMBL4081496
TypeSmall organic molecule
Emp. Form.C26H35FN4O
Mol. Mass.438.5807
SMILESCN(C)[C@H]1CN(Cc2c(C)cccc2F)C[C@@H]1c1ccc(cc1)N1CCN(CC1)C(C)=O