Reaction Details
TargetPolycomb protein EED
LigandBDBM50235631
Substrate/Competitorn/a
Meas. Tech.ChEMBL_1670154 (CHEMBL4020042)
Kd 4.0±n/a nM
Citation Wang, YEdalji, RPPanchal, SCSun, CDjuric, SWVasudevan, A Are We There Yet? Applying Thermodynamic and Kinetic Profiling on Embryonic Ectoderm Development (EED) Hit-to-Lead Program. J Med Chem60:8321-8335 (2017) 
 
Polycomb protein EED
Name:Polycomb protein EED
Type:Protein
Mol. Mass.:50201.68
Organism:Homo sapiens (Human)
Description:O75530
Residue:441
BDBM50235631
NameBDBM50235631
Synonyms:CHEMBL4060827
TypeSmall organic molecule
Emp. Form.C27H35FN4O
Mol. Mass.450.5914
SMILESCN(C)[C@H]1CN(C[C@@H]1c1ccc(cc1)N1CCN(CC1)C(C)=O)C1CCc2cccc(F)c12