Reaction Details
TargetPolycomb protein EED
LigandBDBM50241648
Substrate/Competitorn/a
Meas. Tech.ChEMBL_1670151 (CHEMBL4020039)
Ki 10.0±n/a nM
Citation Wang, YEdalji, RPPanchal, SCSun, CDjuric, SWVasudevan, A Are We There Yet? Applying Thermodynamic and Kinetic Profiling on Embryonic Ectoderm Development (EED) Hit-to-Lead Program. J Med Chem60:8321-8335 (2017) 
 
Polycomb protein EED
Name:Polycomb protein EED
Type:Protein
Mol. Mass.:50201.68
Organism:Homo sapiens (Human)
Description:O75530
Residue:441
BDBM50241648
NameBDBM50241648
Synonyms:CHEMBL4072980
TypeSmall organic molecule
Emp. Form.C21H27FN2O2S
Mol. Mass.390.515
SMILESCN(C)[C@H]1CN(Cc2c(C)cccc2F)C[C@@H]1c1ccc(cc1)S(C)(=O)=O