Reaction Details
TargetOxidized purine nucleoside triphosphate hydrolase
LigandBDBM50035880
Substrate/Competitorn/a
Meas. Tech.ChEMBL_1670159 (CHEMBL4020047)
IC50 170±n/a nM
Citation Rudling, AGustafsson, RAlmlöf, IHoman, EScobie, MWarpman Berglund, UHelleday, TStenmark, PCarlsson, J Fragment-Based Discovery and Optimization of Enzyme Inhibitors by Docking of Commercial Chemical Space. J Med Chem60:8160-8169 (2017) 
 
Oxidized purine nucleoside triphosphate hydrolase
Name:Oxidized purine nucleoside triphosphate hydrolase
Type:Protein
Mol. Mass.:22514.81
Organism:Homo sapiens (Human)
Description:P36639
Residue:197
BDBM50035880
NameBDBM50035880
Synonyms:CHEMBL1437990
TypeSmall organic molecule
Emp. Form.C13H13N5S
Mol. Mass.271.341
SMILESNc1nc(SCCc2ccccc2)c2nc[nH]c2n1