Reaction Details
TargetBeta-2 adrenergic receptor
LigandBDBM50002132
Substrate/Competitorn/a
Meas. Tech.ChEBML_38603
IC50 30±n/a nM
Citation Bloom, JDDutia, MDJohnson, BDWissner, ABurns, MGLargis, EEDolan, JAClaus, TH Disodium (R,R)-5-[2-[[2-(3-chlorophenyl)-2-hydroxyethyl]-amino] propyl]-1,3-benzodioxole-2,2-dicarboxylate (CL 316,243). A potent beta-adrenergic agonist virtually specific for beta 3 receptors. A promising antidiabetic and antiobesity agent. J Med Chem35:3081-4 (1992) Beta-2 adrenergic receptor
Name:Beta-2 adrenergic receptor
Type:PROTEIN
Mol. Mass.:46896.26
Organism:Rattus norvegicus
Description:ChEMBL_38603
Residue:418
BDBM50002132
NameBDBM50002132
Synonyms:(4-{(R)-2-[(R)-2-(3-Chloro-phenyl)-2-hydroxy-ethylamino]-propyl}-phenoxy)-acetic acid methyl ester CHEMBL38486
TypeSmall organic molecule
Emp. Form.C20H24ClNO4
Mol. Mass.377.862
SMILESCOC(=O)COc1ccc(C[C@@H](C)NC[C@H](O)c2cccc(Cl)c2)cc1