Reaction Details
TargetD(2) dopamine receptor
LigandBDBM50002169
Substrate/Competitorn/a
Meas. Tech.ChEMBL_62422 (CHEMBL674826)
Ki 2.5±n/a nM
Citation Böttcher, HBarnickel, GHausberg, HHHaase, AFSeyfried, CAEiermann, V Synthesis and dopaminergic activity of some 3-(1,2,3,6-tetrahydro-1-pyridylalkyl)indoles. A novel conformational model to explain structure-activity relationships. J Med Chem35:4020-6 (1992) D(2) dopamine receptor
Name:D(2) dopamine receptor
Type:G Protein-Coupled Receptor (GPCR)
Mol. Mass.:50931.60
Organism:Rattus norvegicus (rat)
Description:P61169
Residue:444
BDBM50002169
NameBDBM50002169
Synonyms:3-[4-(4-Phenyl-3,6-dihydro-2H-pyridin-1-yl)-butyl]-1H-indol-6-ol | CHEMBL130502
TypeSmall organic molecule
Emp. Form.C23H26N2O
Mol. Mass.346.4653
SMILESOc1ccc2c(CCCCN3CCC(=CC3)c3ccccc3)c[nH]c2c1