Reaction Details
TargetHistone acetyltransferase KAT2A
LigandBDBM220447
Substrate/Competitorn/a
Meas. Tech.ChEMBL_1670375 (CHEMBL4020263)
Kd>1000±n/a nM
Citation McDaniel, KFWang, LSoltwedel, TFidanze, SDHasvold, LALiu, DMantei, RAPratt, JKSheppard, GSBui, MHFaivre, EJHuang, XLi, LLin, XWang, RWarder, SEWilcox, DAlbert, DHMagoc, TJRajaraman, GPark, CHHutchins, CWShen, JJEdalji, RPSun, CCMartin, RGao, WWong, SFang, GElmore, SWShen, YKati, WM Discovery of N-(4-(2,4-Difluorophenoxy)-3-(6-methyl-7-oxo-6,7-dihydro-1H-pyrrolo[2,3-c]pyridin-4-yl)phenyl)ethanesulfonamide (ABBV-075/Mivebresib), a Potent and Orally Available Bromodomain and Extraterminal Domain (BET) Family Bromodomain Inhibitor. J Med Chem60:8369-8384 (2017) 
 
Histone acetyltransferase KAT2A
Name:Histone acetyltransferase KAT2A
Type:PROTEIN
Mol. Mass.:93956.22
Organism:Homo sapiens (Human)
Description:ChEMBL_100876
Residue:837
BDBM220447
NameBDBM220447
Synonyms:US10633379, Compound X | US9296741, 36
TypeSmall organic molecule
Emp. Form.C22H19F2N3O4S
Mol. Mass.459.466
SMILESCCS(=O)(=O)Nc1ccc(Oc2ccc(F)cc2F)c(c1)-c1cn(C)c(=O)c2[nH]ccc12