Reaction Details
TargetBromodomain-containing protein 4
LigandBDBM50241752
Substrate/Competitorn/a
Meas. Tech.ChEMBL_1670329 (CHEMBL4020217)
Ki 430±n/a nM
Citation McDaniel, KFWang, LSoltwedel, TFidanze, SDHasvold, LALiu, DMantei, RAPratt, JKSheppard, GSBui, MHFaivre, EJHuang, XLi, LLin, XWang, RWarder, SEWilcox, DAlbert, DHMagoc, TJRajaraman, GPark, CHHutchins, CWShen, JJEdalji, RPSun, CCMartin, RGao, WWong, SFang, GElmore, SWShen, YKati, WM Discovery of N-(4-(2,4-Difluorophenoxy)-3-(6-methyl-7-oxo-6,7-dihydro-1H-pyrrolo[2,3-c]pyridin-4-yl)phenyl)ethanesulfonamide (ABBV-075/Mivebresib), a Potent and Orally Available Bromodomain and Extraterminal Domain (BET) Family Bromodomain Inhibitor. J Med Chem60:8369-8384 (2017) 
 
Bromodomain-containing protein 4
Name:Bromodomain-containing protein 4
Type:Protein
Mol. Mass.:152264.84
Organism:Homo sapiens (Human)
Description:O60885
Residue:1362
BDBM50241752
NameBDBM50241752
Synonyms:CHEMBL4089203
TypeSmall organic molecule
Emp. Form.C22H28N4O4S
Mol. Mass.444.547
SMILESCCS(=O)(=O)Nc1ccc(OC2CCN(C)CC2)c(c1)-c1cn(C)c(=O)c2[nH]ccc12