Reaction Details
TargetMu-type opioid receptor
LigandBDBM50002178
Substrate/Competitorn/a
Meas. Tech.ChEBML_146549
Ki 0.030000±n/a nM
Citation Snyder, KRStory, SCHeidt, MEMurray, TFDeLander, GEAldrich, JV Effect of modification of the basic residues of dynorphin A-(1-13) amide on kappa opioid receptor selectivity and opioid activity. J Med Chem35:4330-3 (1992) Mu-type opioid receptor
Name:Mu-type opioid receptor
Type:G Protein-Coupled Receptor (GPCR)
Mol. Mass.:44503.11
Organism:Rattus norvegicus (rat)
Description:Competition binding assays were carried out using membrane preparations from transfected HN9.10 cells that constitutively expressed the mu opioid receptor.
Residue:398
BDBM50002178
NameBDBM50002178
Synonyms:CHEMBL440446 | Tyr-Gly-Gly-Phe-Leu-Arg-Arg-Ile-Arg-Pro-Lys(Ac)-Leu-Lys
TypeSmall organic molecule
Emp. Form.C77H129N25O15
Mol. Mass.1645.0067
SMILESCC[C@H](C)[C@H](NC(=O)[C@H](CCCNC(N)=N)NC(=O)[C@H](CCCNC(N)=N)NC(=O)[C@H](CC(C)C)NC(=O)[C@H](Cc1ccccc1)NC(=O)CNC(=O)CNC(=O)[C@@H](N)Cc1ccc(O)cc1)C(=O)N[C@@H](CCCNC(N)=N)C(=O)N1CCC[C@H]1C(=O)N[C@@H](CCCCNC(C)=O)C(=O)N[C@@H](CC(C)C)C(=O)N[C@@H](CCCCN)C(N)=O