Reaction Details
TargetKappa-type opioid receptor
LigandBDBM50002181
Substrate/Competitorn/a
Meas. Tech.ChEBML_145346
Ki 0.020000±n/a nM
Citation Snyder, KRStory, SCHeidt, MEMurray, TFDeLander, GEAldrich, JV Effect of modification of the basic residues of dynorphin A-(1-13) amide on kappa opioid receptor selectivity and opioid activity. J Med Chem35:4330-3 (1992) Kappa-type opioid receptor
Name:Kappa-type opioid receptor
Type:G Protein-Coupled Receptor (GPCR)
Mol. Mass.:42744.99
Organism:Cavia porcellus (domestic guinea pig)
Description:P41144
Residue:380
BDBM50002181
NameBDBM50002181
Synonyms:CHEMBL266717 | Tyr-Gly-Gly-Phe-Leu-Lys-Arg-Ile-Arg-Pro-Lys-Leu-Lys
TypeSmall organic molecule
Emp. Form.C75H127N23O14
Mol. Mass.1574.9566
SMILESCC[C@H](C)[C@H](NC(=O)[C@H](CCCNC(N)=N)NC(=O)[C@H](CCCCN)NC(=O)[C@H](CC(C)C)NC(=O)[C@H](Cc1ccccc1)NC(=O)CNC(=O)CNC(=O)[C@@H](N)Cc1ccc(O)cc1)C(=O)N[C@@H](CCCNC(N)=N)C(=O)N1CCC[C@H]1C(=O)N[C@@H](CCCCN)C(=O)N[C@@H](CC(C)C)C(=O)N[C@@H](CCCCN)C(N)=O