Reaction Details
TargetLeucine--tRNA ligase
LigandBDBM50241795
Substrate/Competitorn/a
Meas. Tech.ChEMBL_1670423 (CHEMBL4020311)
IC50 76±n/a nM
Citation Li, XHernandez, VRock, FLChoi, WMak, YSLMohan, MMao, WZhou, YEasom, EEPlattner, JJZou, WPérez-Herrán, EGiordano, IMendoza-Losana, AAlemparte, CRullas, JAngulo-Barturen, ICrouch, SOrtega, FBarros, DAlley, MRK Discovery of a Potent and Specific M. tuberculosis Leucyl-tRNA Synthetase Inhibitor: (S)-3-(Aminomethyl)-4-chloro-7-(2-hydroxyethoxy)benzo[c][1,2]oxaborol-1(3H)-ol (GSK656). J Med Chem60:8011-8026 (2017) 
 
Leucine--tRNA ligase
Name:Leucine--tRNA ligase
Type:PROTEIN
Mol. Mass.:107566.69
Organism:Mycobacterium tuberculosis (strain ATCC 25618 / H37Rv)
Description:ChEMBL_117449
Residue:969
BDBM50241795
NameBDBM50241795
Synonyms:CHEMBL4104309
TypeSmall organic molecule
Emp. Form.C10H13BCl2FNO3
Mol. Mass.295.931
SMILESCl.NCC1OB(O)c2c1c(Cl)ccc2OCCF