Reaction Details
TargetCyclin-C
LigandBDBM50241875
Substrate/Competitorn/a
Meas. Tech.ChEMBL_1670926 (CHEMBL4020955)
IC50 0.540000±n/a nM
Citation Fujimoto, JHirayama, THirata, YHikichi, YMurai, SHasegawa, MHasegawa, YYonemori, KHata, AAoyama, KCary, DR Studies of CDK 8/19 inhibitors: Discovery of novel and selective CDK8/19 dual inhibitors and elimination of their CYP3A4 time-dependent inhibition potential. Bioorg Med Chem25:3018-3033 (2017) 
 
Cyclin-C
Name:Cyclin-C
Type:PROTEIN
Mol. Mass.:33244.88
Organism:Homo sapiens (Human)
Description:ChEMBL_107900
Residue:283
BDBM50241875
NameBDBM50241875
Synonyms:CHEMBL4091527
TypeSmall organic molecule
Emp. Form.C22H23N5O2
Mol. Mass.389.4503
SMILESO=C(Nc1ccc(CN2CCOCC2)cc1)\C=C\c1cnccc1-c1cn[nH]c1