Reaction Details
TargetHistone deacetylase 6
LigandBDBM50241901
Substrate/Competitorn/a
Meas. Tech.ChEMBL_1670960 (CHEMBL4020989)
IC50 6.8±n/a nM
Citation Mehndiratta, SWang, RSHuang, HLSu, CJHsu, CMWu, YWPan, SLLiou, JP 4-Indolyl-N-hydroxyphenylacrylamides as potent HDAC class I and IIB inhibitors in vitro and in vivo. Eur J Med Chem134:13-23 (2017) 
 
Histone deacetylase 6
Name:Histone deacetylase 6
Type:Chromatin regulator; hydrolase; repressor
Mol. Mass.:131381.51
Organism:Homo sapiens (Human)
Description:Q9UBN7
Residue:1215
BDBM50241901
NameBDBM50241901
Synonyms:CHEMBL4065026
TypeSmall organic molecule
Emp. Form.C20H21N3O4S
Mol. Mass.399.463
SMILESCn1ccc2c(CCNS(=O)(=O)c3ccc(\C=C\C(=O)NO)cc3)cccc12