Reaction Details
TargetHistone deacetylase 1
LigandBDBM25150
Substrate/Competitorn/a
Meas. Tech.ChEMBL_1670958 (CHEMBL4020987)
IC50 20±n/a nM
Citation Mehndiratta, SWang, RSHuang, HLSu, CJHsu, CMWu, YWPan, SLLiou, JP 4-Indolyl-N-hydroxyphenylacrylamides as potent HDAC class I and IIB inhibitors in vitro and in vivo. Eur J Med Chem134:13-23 (2017) 
 
Histone deacetylase 1
Name:Histone deacetylase 1
Type:Enzyme
Mol. Mass.:55090.27
Organism:Homo sapiens (Human)
Description:Q13547
Residue:482
BDBM25150
NameBDBM25150
Synonyms:(2E)-N-hydroxy-3-[3-(phenylsulfamoyl)phenyl]prop-2-enamide Belinostat PXD101
TypeSmall organic molecule
Emp. Form.C15H14N2O4S
Mol. Mass.318.348
SMILESONC(=O)\C=C\c1cccc(c1)S(=O)(=O)Nc1ccccc1