Reaction Details
TargetHistone deacetylase 2
LigandBDBM50241905
Substrate/Competitorn/a
Meas. Tech.ChEMBL_1670952 (CHEMBL4020981)
IC50 0.180000±n/a nM
Citation Mehndiratta, SWang, RSHuang, HLSu, CJHsu, CMWu, YWPan, SLLiou, JP 4-Indolyl-N-hydroxyphenylacrylamides as potent HDAC class I and IIB inhibitors in vitro and in vivo. Eur J Med Chem134:13-23 (2017) 
 
Histone deacetylase 2
Name:Histone deacetylase 2
Type:Chromatin regulator; hydrolase; repressor
Mol. Mass.:55356.54
Organism:Homo sapiens (Human)
Description:Q92769
Residue:488
BDBM50241905
NameBDBM50241905
Synonyms:CHEMBL4080164
TypeSmall organic molecule
Emp. Form.C21H24ClN3O2
Mol. Mass.385.887
SMILESCl.Cc1[nH]c2ccccc2c1CCNCc1cccc(\C=C\C(=O)NO)c1