Reaction Details
TargetHistone deacetylase 6
LigandBDBM50241905
Substrate/Competitorn/a
Meas. Tech.ChEMBL_1670960 (CHEMBL4020989)
IC50 14±n/a nM
Citation Mehndiratta, SWang, RSHuang, HLSu, CJHsu, CMWu, YWPan, SLLiou, JP 4-Indolyl-N-hydroxyphenylacrylamides as potent HDAC class I and IIB inhibitors in vitro and in vivo. Eur J Med Chem134:13-23 (2017) 
 
Histone deacetylase 6
Name:Histone deacetylase 6
Type:Chromatin regulator; hydrolase; repressor
Mol. Mass.:131381.51
Organism:Homo sapiens (Human)
Description:Q9UBN7
Residue:1215
BDBM50241905
NameBDBM50241905
Synonyms:CHEMBL4080164
TypeSmall organic molecule
Emp. Form.C21H24ClN3O2
Mol. Mass.385.887
SMILESCl.Cc1[nH]c2ccccc2c1CCNCc1cccc(\C=C\C(=O)NO)c1