Reaction Details
TargetAcetylcholinesterase
LigandBDBM50240416
Substrate/Competitorn/a
Meas. Tech.ChEMBL_1671093 (CHEMBL4021122)
Kd 170000±n/a nM
Citation Mohammed, ASneathen, JFrojen, SGKuo, LDupureur, CM Stereospecific cholinesterase inhibition by O,S-diethylphenylphosphonothioate. Bioorg Med Chem25:3053-3058 (2017) 
 
Acetylcholinesterase
Name:Acetylcholinesterase
Type:Enzyme
Mol. Mass.:71812.79
Organism:Electrophorus electricus (Electric eel)
Description:n/a
Residue:633
BDBM50240416
NameBDBM50240416
Synonyms:CHEMBL23838 diethyl 4-nitrophenyl phosphate diethyl paraoxon p-nitrophenyl diethyl phosphate phosphacol | phosphoric acid diethyl 4-nitrophenyl ester
TypeSmall organic molecule
Emp. Form.C10H14NO6P
Mol. Mass.275.195
SMILESCCOP(=O)(OCC)Oc1ccc(cc1)[N+]([O-])=O