Reaction Details
TargetMuscarinic acetylcholine receptor M3
LigandBDBM50246629
Substrate/Competitorn/a
Meas. Tech.ChEMBL_1676737 (CHEMBL4026880)
Ki 780±n/a nM
Citation Fish, IStößel, AEitel, KValant, CAlbold, SHuebner, HMöller, DClark, MJSunahara, RKChristopoulos, AShoichet, BKGmeiner, P Structure-Based Design and Discovery of New M J Med Chem60:9239-9250 (2017) 
 
Muscarinic acetylcholine receptor M3
Name:Muscarinic acetylcholine receptor M3
Type:Enzyme
Mol. Mass.:66151.03
Organism:Homo sapiens (Human)
Description:P20309
Residue:590
BDBM50246629
NameBDBM50246629
Synonyms:CHEMBL4073256
TypeSmall organic molecule
Emp. Form.C10H15NO
Mol. Mass.165.2322
SMILESCNCCc1cccc(OC)c1