Reaction Details
TargetMuscarinic acetylcholine receptor M1
LigandBDBM50246674
Substrate/Competitorn/a
Meas. Tech.ChEMBL_1676735 (CHEMBL4026878)
Ki 4200±n/a nM
Citation Fish, IStößel, AEitel, KValant, CAlbold, SHuebner, HMöller, DClark, MJSunahara, RKChristopoulos, AShoichet, BKGmeiner, P Structure-Based Design and Discovery of New M J Med Chem60:9239-9250 (2017) 
 
Muscarinic acetylcholine receptor M1
Name:Muscarinic acetylcholine receptor M1
Type:Protein
Mol. Mass.:51442.54
Organism:Homo sapiens (Human)
Description:P11229
Residue:460
BDBM50246674
NameBDBM50246674
Synonyms:CHEMBL4072787
TypeSmall organic molecule
Emp. Form.C8H12N2OS
Mol. Mass.184.259
SMILESC(OC1CCNC1)c1nccs1