Reaction Details
TargetMuscarinic acetylcholine receptor M2
LigandBDBM50246734
Substrate/Competitorn/a
Meas. Tech.ChEMBL_1676736 (CHEMBL4026879)
Ki 1300±n/a nM
Citation Fish, IStößel, AEitel, KValant, CAlbold, SHuebner, HMöller, DClark, MJSunahara, RKChristopoulos, AShoichet, BKGmeiner, P Structure-Based Design and Discovery of New M J Med Chem60:9239-9250 (2017) 
 
Muscarinic acetylcholine receptor M2
Name:Muscarinic acetylcholine receptor M2
Type:GPCR
Mol. Mass.:51730.61
Organism:Homo sapiens (Human)
Description:P08172
Residue:466
BDBM50246734
NameBDBM50246734
Synonyms:CHEMBL4103375
TypeSmall organic molecule
Emp. Form.C16H25NO3
Mol. Mass.279.3746
SMILES[O-]C=O.COc1cccc2CCC(C[N+](C)(C)C)Cc12