Reaction Details
TargetMuscarinic acetylcholine receptor M1
LigandBDBM10759
Substrate/Competitorn/a
Meas. Tech.ChEMBL_1676754 (CHEMBL4026897)
EC50 47±n/a nM
Citation Fish, IStößel, AEitel, KValant, CAlbold, SHuebner, HMöller, DClark, MJSunahara, RKChristopoulos, AShoichet, BKGmeiner, P Structure-Based Design and Discovery of New M J Med Chem60:9239-9250 (2017) 
 
Muscarinic acetylcholine receptor M1
Name:Muscarinic acetylcholine receptor M1
Type:Protein
Mol. Mass.:51442.54
Organism:Homo sapiens (Human)
Description:P11229
Residue:460
BDBM10759
NameBDBM10759
Synonyms:2-acetoxyethyl(trimethyl)ammonium;bromide CHEMBL667 [2-(acetyloxy)ethyl]trimethylazanium acetylcholine chloride | cid_6060
TypeSmall Organic Molecule
Emp. Form.C7H16NO2
Mol. Mass.146.2069
SMILESCC(=O)OCC[N+](C)(C)C