Reaction Details
TargetMuscarinic acetylcholine receptor M2
LigandBDBM50246712
Substrate/Competitorn/a
Meas. Tech.ChEMBL_1676736 (CHEMBL4026879)
Ki 630±n/a nM
Citation Fish, IStößel, AEitel, KValant, CAlbold, SHuebner, HMöller, DClark, MJSunahara, RKChristopoulos, AShoichet, BKGmeiner, P Structure-Based Design and Discovery of New M J Med Chem60:9239-9250 (2017) 
 
Muscarinic acetylcholine receptor M2
Name:Muscarinic acetylcholine receptor M2
Type:GPCR
Mol. Mass.:51730.61
Organism:Homo sapiens (Human)
Description:P08172
Residue:466
BDBM50246712
NameBDBM50246712
Synonyms:CHEMBL4081662
TypeSmall organic molecule
Emp. Form.C13H22INO
Mol. Mass.335.2244
SMILES[I-].COc1cccc(CCC[N+](C)(C)C)c1