Reaction Details
TargetMuscarinic acetylcholine receptor M2
LigandBDBM50246727
Substrate/Competitorn/a
Meas. Tech.ChEMBL_1676736 (CHEMBL4026879)
Ki 1200±n/a nM
Citation Fish, IStößel, AEitel, KValant, CAlbold, SHuebner, HMöller, DClark, MJSunahara, RKChristopoulos, AShoichet, BKGmeiner, P Structure-Based Design and Discovery of New M J Med Chem60:9239-9250 (2017) 
 
Muscarinic acetylcholine receptor M2
Name:Muscarinic acetylcholine receptor M2
Type:GPCR
Mol. Mass.:51730.61
Organism:Homo sapiens (Human)
Description:P08172
Residue:466
BDBM50246727
NameBDBM50246727
Synonyms:CHEMBL4075227
TypeSmall organic molecule
Emp. Form.C13H19NO
Mol. Mass.205.2961
SMILESCOc1cccc2CCC(Cc12)N(C)C