Reaction Details
TargetMuscarinic acetylcholine receptor M3
LigandBDBM50246652
Substrate/Competitorn/a
Meas. Tech.ChEMBL_1676737 (CHEMBL4026880)
Ki 210±n/a nM
Citation Fish, IStößel, AEitel, KValant, CAlbold, SHuebner, HMöller, DClark, MJSunahara, RKChristopoulos, AShoichet, BKGmeiner, P Structure-Based Design and Discovery of New M J Med Chem60:9239-9250 (2017) 
 
Muscarinic acetylcholine receptor M3
Name:Muscarinic acetylcholine receptor M3
Type:Enzyme
Mol. Mass.:66151.03
Organism:Homo sapiens (Human)
Description:P20309
Residue:590
BDBM50246652
NameBDBM50246652
Synonyms:CHEMBL4102555
TypeSmall organic molecule
Emp. Form.C13H19NO4
Mol. Mass.253.2943
SMILES[O-]C=O.COc1cccc(c1)C(=O)C[N+](C)(C)C