Reaction Details
TargetMuscarinic acetylcholine receptor M1
LigandBDBM50246712
Substrate/Competitorn/a
Meas. Tech.ChEMBL_1676735 (CHEMBL4026878)
Ki 330±n/a nM
Citation Fish, IStößel, AEitel, KValant, CAlbold, SHuebner, HMöller, DClark, MJSunahara, RKChristopoulos, AShoichet, BKGmeiner, P Structure-Based Design and Discovery of New M J Med Chem60:9239-9250 (2017) 
 
Muscarinic acetylcholine receptor M1
Name:Muscarinic acetylcholine receptor M1
Type:Protein
Mol. Mass.:51442.54
Organism:Homo sapiens (Human)
Description:P11229
Residue:460
BDBM50246712
NameBDBM50246712
Synonyms:CHEMBL4081662
TypeSmall organic molecule
Emp. Form.C13H22INO
Mol. Mass.335.2244
SMILES[I-].COc1cccc(CCC[N+](C)(C)C)c1