Reaction Details
TargetFolylpolyglutamate synthase, mitochondrial
LigandBDBM50002471
Substrate/Competitorn/a
Meas. Tech.ChEMBL_68676 (CHEMBL682447)
Ki 64±n/a nM
Citation Singh, SKSinger, SCFerone, RWaters, KAMullin, RJHynes, JB Synthesis and biological evaluation of N alpha-(5-deaza-5,6,7,8-tetrahydropteroyl)-L-ornithine. J Med Chem35:2002-6 (1992) Folylpolyglutamate synthase, mitochondrial
Name:Folylpolyglutamate synthase, mitochondrial
Type:PROTEIN
Mol. Mass.:64621.95
Organism:Homo sapiens (Human)
Description:ChEMBL_68676
Residue:587
BDBM50002471
NameBDBM50002471
Synonyms:5-Amino-2-{4-[(2-amino-4-oxo-2,3,4,4a,5,6,7,8-octahydro-pyrido[2,3-d]pyrimidin-6-ylmethyl)-amino]-benzoylamino}-pentanoic acid CHEMBL289923
TypeSmall organic molecule
Emp. Form.C20H27N7O4
Mol. Mass.429.4729
SMILESNCCCC(NC(=O)c1ccc(NCC2CNc3nc(N)[nH]c(=O)c3C2)cc1)C(O)=O