Reaction Details
TargetHepatocyte growth factor receptor
LigandBDBM28031
Substrate/Competitorn/a
Meas. Tech.ChEMBL_1671239 (CHEMBL4021268)
IC50 3.9±n/a nM
Citation Zhao, YZhang, JZhuang, RHe, RXi, JPan, XShao, YPan, JSun, JCai, ZLiu, SHuang, WLv, X Synthesis and evaluation of a series of pyridine and pyrimidine derivatives as type II c-Met inhibitors. Bioorg Med Chem25:3195-3205 (2017) 
 
Hepatocyte growth factor receptor
Name:Hepatocyte growth factor receptor
Type:Protein
Mol. Mass.:155559.73
Organism:Homo sapiens (Human)
Description:P08581
Residue:1390
BDBM28031
NameBDBM28031
Synonyms:BMS-777607 | N-{4-[(2-amino-3-chloropyridin-4-yl)oxy]-3-fluorophenyl}-4-ethoxy-1-(4-fluorophenyl)-2-oxo-1,2-dihydropyridine-3-carboxamide
TypeSmall organic molecule
Emp. Form.C25H19ClF2N4O4
Mol. Mass.512.893
SMILESCCOc1ccn(-c2ccc(F)cc2)c(=O)c1C(=O)Nc1ccc(Oc2ccnc(N)c2Cl)c(F)c1