Reaction Details
TargetSubstance-P receptor
LigandBDBM50002659
Substrate/Competitorn/a
Meas. Tech.ChEMBL_205719 (CHEMBL807965)
IC50 20±n/a nM
Citation Lowe, JADrozda, SESnider, RMLongo, KPZorn, SHMorrone, JJackson, ERMcLean, SBryce, DKBordner, J The discovery of (2S,3S)-cis-2-(diphenylmethyl)-N-[(2-methoxyphenyl)methyl]-1- azabicyclo[2.2.2]-octan-3-amine as a novel, nonpeptide substance P antagonisst. J Med Chem35:2591-600 (1992) Substance-P receptor
Name:Substance-P receptor
Type:G Protein-Coupled Receptor (GPCR)
Mol. Mass.:46254.43
Organism:Homo sapiens (Human)
Description:P25103
Residue:407
BDBM50002659
NameBDBM50002659
Synonyms:((2S,3S)-2-Benzhydryl-1-aza-bicyclo[2.2.2]oct-3-yl)-(3-methoxy-benzyl)-amine CHEMBL86806
TypeSmall organic molecule
Emp. Form.C28H32N2O
Mol. Mass.412.5665
SMILESCOc1cccc(CN[C@H]2C3CCN(CC3)[C@H]2C(c2ccccc2)c2ccccc2)c1