Reaction Details
TargetProtein-tyrosine kinase 2-beta
LigandBDBM50318884
Substrate/Competitorn/a
Meas. Tech.ChEMBL_1671254 (CHEMBL4021283)
IC50 13±n/a nM
Citation Chadha, NSilakari, O Indoles as therapeutics of interest in medicinal chemistry: Bird's eye view. Eur J Med Chem134:159-184 (2017) 
 
Protein-tyrosine kinase 2-beta
Name:Protein-tyrosine kinase 2-beta
Type:Protein
Mol. Mass.:115868.80
Organism:Homo sapiens (Human)
Description:Q14289
Residue:1009
BDBM50318884
NameBDBM50318884
Synonyms:CHEMBL1084546 N-methyl-N-(3-((2-(2-oxoindolin-5-ylamino)-5-(trifluoromethyl)pyrimidin-4-ylamino)methyl)pyridin-2-yl)methanesulfonamide PF-562271
TypeSmall organic molecule
Emp. Form.C21H20F3N7O3S
Mol. Mass.507.489
SMILESCN(c1ncccc1CNc1nc(Nc2ccc3NC(=O)Cc3c2)ncc1C(F)(F)F)S(C)(=O)=O