Reaction Details
TargetAdenosine receptor A2b
LigandBDBM50242131
Substrate/Competitorn/a
Meas. Tech.ChEMBL_1671313 (CHEMBL4021342)
Ki 1.3±n/a nM
Citation Basu, SBarawkar, DARamdas, VPatel, MWaman, YPanmand, AKumar, SThorat, SNaykodi, MGoswami, AReddy, BSPrasad, VChaturvedi, SQuraishi, AMenon, SPaliwal, SKulkarni, AKarande, VGhosh, IMustafa, SDe, SJain, VBanerjee, ERRouduri, SRPalle, VPChugh, AMookhtiar, KA Design and synthesis of novel xanthine derivatives as potent and selective A Eur J Med Chem134:218-229 (2017) 
 
Adenosine receptor A2b
Name:Adenosine receptor A2b
Type:G Protein-Coupled Receptor (GPCR)
Mol. Mass.:36341.22
Organism:Homo sapiens (Human)
Description:n/a
Residue:332
BDBM50242131
NameBDBM50242131
Synonyms:CHEMBL4087158
TypeSmall organic molecule
Emp. Form.C21H17F3N6O2
Mol. Mass.442.3939
SMILESCCCn1c(=O)[nH]c2nc([nH]c2c1=O)-c1cnn(CC#Cc2ccc(cc2)C(F)(F)F)c1