Reaction Details
TargetCarbonic anhydrase 1
LigandBDBM50242141
Substrate/Competitorn/a
Meas. Tech.ChEBML_1671361
Ki>10000±n/a nM
Citation Ivanova, JCarta, FVullo, DLeitans, JKazaks, ATars, K?alubovskis, RSupuran, CT N-Substituted and ring opened saccharin derivatives selectively inhibit transmembrane, tumor-associated carbonic anhydrases IX and XII. Bioorg Med Chem25:3583-3589 (2017) 
 
Carbonic anhydrase 1
Name:Carbonic anhydrase 1
Type:Enzyme
Mol. Mass.:28873.37
Organism:Homo sapiens (Human)
Description:P00915
Residue:261
BDBM50242141
NameBDBM50242141
Synonyms:CHEMBL4090838
TypeSmall organic molecule
Emp. Form.C15H13NO3S
Mol. Mass.287.334
SMILESO=C1N(CCc2ccccc2)S(=O)(=O)c2ccccc12