Reaction Details
TargetCarbonic anhydrase 2
LigandBDBM50242150
Substrate/Competitorn/a
Meas. Tech.ChEBML_1671362
Ki>10000±n/a nM
Citation Ivanova, JCarta, FVullo, DLeitans, JKazaks, ATars, K?alubovskis, RSupuran, CT N-Substituted and ring opened saccharin derivatives selectively inhibit transmembrane, tumor-associated carbonic anhydrases IX and XII. Bioorg Med Chem25:3583-3589 (2017) 
 
Carbonic anhydrase 2
Name:Carbonic anhydrase 2
Type:Enzyme
Mol. Mass.:29250.71
Organism:Homo sapiens (Human)
Description:P00918
Residue:260
BDBM50242150
NameBDBM50242150
Synonyms:CHEMBL4081415
TypeSmall organic molecule
Emp. Form.C10H13NO4S
Mol. Mass.243.28
SMILESCCCNS(=O)(=O)c1ccccc1C(O)=O