Reaction Details
TargetCarbonic anhydrase 9
LigandBDBM50242153
Substrate/Competitorn/a
Meas. Tech.ChEBML_1671363
Ki 102±n/a nM
Citation Ivanova, JCarta, FVullo, DLeitans, JKazaks, ATars, K?alubovskis, RSupuran, CT N-Substituted and ring opened saccharin derivatives selectively inhibit transmembrane, tumor-associated carbonic anhydrases IX and XII. Bioorg Med Chem25:3583-3589 (2017) 
 
Carbonic anhydrase 9
Name:Carbonic anhydrase 9
Type:Enzyme
Mol. Mass.:49669.03
Organism:Homo sapiens (Human)
Description:Catalytic domain of human cloned isozyme was used in the assay
Residue:459
BDBM50242153
NameBDBM50242153
Synonyms:CHEMBL421511
TypeSmall organic molecule
Emp. Form.C12H15NO3S
Mol. Mass.253.317
SMILESCCCCCN1C(=O)c2ccccc2S1(=O)=O