Reaction Details
TargetMast/stem cell growth factor receptor Kit
LigandBDBM50242167
Substrate/Competitorn/a
Meas. Tech.ChEMBL_1670632 (CHEMBL4020520)
IC50 2.1±n/a nM
Citation Kaitsiotou, HKeul, MHardick, JMühlenberg, TKetzer, JEhrt, CKrüll, JMedda, FKoch, OGiordanetto, FBauer, SRauh, D Inhibitors to Overcome Secondary Mutations in the Stem Cell Factor Receptor KIT. J Med Chem60:8801-8815 (2017) 
 
Mast/stem cell growth factor receptor Kit
Name:Mast/stem cell growth factor receptor Kit
Type:Protein
Mol. Mass.:109869.37
Organism:Homo sapiens (Human)
Description:P10721
Residue:976
BDBM50242167
NameBDBM50242167
Synonyms:CHEMBL4076193
TypeSmall organic molecule
Emp. Form.C29H30F3N5O
Mol. Mass.521.5766
SMILESCN1CCN(Cc2ccc(NC(=O)c3ccc(C)c(c3)C#Cc3cnc(N)c(C)c3)cc2C(F)(F)F)CC1