Reaction Details
TargetHistone deacetylase 6
LigandBDBM50242197
Substrate/Competitorn/a
Meas. Tech.ChEMBL_1670756 (CHEMBL4020644)
IC50 60000±n/a nM
Citation Harding, RJFerreira de Freitas, RCollins, PFranzoni, IRavichandran, MOuyang, HJuarez-Ornelas, KALautens, MSchapira, Mvon Delft, FSanthakumar, VArrowsmith, CH Small Molecule Antagonists of the Interaction between the Histone Deacetylase 6 Zinc-Finger Domain and Ubiquitin. J Med Chem60:9090-9096 (2017) 
 
Histone deacetylase 6
Name:Histone deacetylase 6
Type:Chromatin regulator; hydrolase; repressor
Mol. Mass.:131381.51
Organism:Homo sapiens (Human)
Description:Q9UBN7
Residue:1215
BDBM50242197
NameBDBM50242197
Synonyms:CHEMBL4102489
TypeSmall organic molecule
Emp. Form.C17H14N2O2S
Mol. Mass.310.37
SMILESOC(=O)CCc1nc2ccccc2nc1Sc1ccccc1