Reaction Details
TargetThromboxane A2 receptor
LigandBDBM50002772
Substrate/Competitorn/a
Meas. Tech.ChEBML_209439
Ki 5.1±n/a nM
Citation Ohshima, ETakami, HSato, HObase, HMiki, IIshii, AKarasawa, AKubo, K Non-prostanoid thromboxane A2 receptor antagonists with a dibenzoxepin ring system. 1. J Med Chem35:3394-402 (1992) Thromboxane A2 receptor
Name:Thromboxane A2 receptor
Type:Enyzme
Mol. Mass.:37445.28
Organism:Homo sapiens (Human)
Description:P21731
Residue:343
BDBM50002772
NameBDBM50002772
Synonyms:11-[2-(2-Hydroxy-benzoylamino)-ethylsulfanyl]-6,11-dihydro-dibenzo[b,e]oxepine-2-carboxylic acid | CHEMBL324256
TypeSmall organic molecule
Emp. Form.C24H21NO5S
Mol. Mass.435.492
SMILESOC(=O)c1ccc2OCc3ccccc3C(SCCNC(=O)c3ccccc3O)c2c1