Reaction Details
TargetThromboxane A2 receptor
LigandBDBM50002751
Substrate/Competitorn/a
Meas. Tech.ChEMBL_209439 (CHEMBL872715)
Ki 250±n/a nM
Citation Ohshima, ETakami, HSato, HObase, HMiki, IIshii, AKarasawa, AKubo, K Non-prostanoid thromboxane A2 receptor antagonists with a dibenzoxepin ring system. 1. J Med Chem35:3394-402 (1992) Thromboxane A2 receptor
Name:Thromboxane A2 receptor
Type:Enyzme
Mol. Mass.:37445.28
Organism:Homo sapiens (Human)
Description:P21731
Residue:343
BDBM50002751
NameBDBM50002751
Synonyms:11-[2-(2-Phenyl-ethenesulfonylamino)-ethylsulfanyl]-6,11-dihydro-dibenzo[b,e]oxepine-2-carboxylic acid | CHEMBL324364
TypeSmall organic molecule
Emp. Form.C25H23NO5S2
Mol. Mass.481.584
SMILESOC(=O)c1ccc2OCc3ccccc3C(SCCNS(=O)(=O)\C=C\c3ccccc3)c2c1