Reaction Details
TargetThromboxane A2 receptor
LigandBDBM50002787
Substrate/Competitorn/a
Meas. Tech.ChEBML_209762
Ki 2.7±n/a nM
Citation Ohshima, ETakami, HSato, HMohri, SObase, HMiki, IIshii, AShirakura, SKarasawa, AKubo, K Non-prostanoid thromboxane A2 receptor antagonists with a dibenzoxepin ring system. 2. J Med Chem35:3402-13 (1992) Thromboxane A2 receptor
Name:Thromboxane A2 receptor
Type:Enyzme
Mol. Mass.:37445.28
Organism:Homo sapiens (Human)
Description:P21731
Residue:343
BDBM50002787
NameBDBM50002787
Synonyms:11-(2-[1,3]Dioxolo[4',5':4,5]benzo[1,2-d]imidazol-5-yl-ethylidene)-6,11-dihydro-dibenzo[b,e]oxepine-2-carboxylic acid (0.5H2O) | CHEMBL115241
TypeSmall organic molecule
Emp. Form.C25H18N2O5
Mol. Mass.426.4208
SMILESOC(=O)c1ccc2OCc3ccccc3\C(=C/Cn3cnc4cc5OCOc5cc34)c2c1