Reaction Details
TargetThromboxane A2 receptor
LigandBDBM50002778
Substrate/Competitorn/a
Meas. Tech.ChEBML_209762
Ki 1.8±n/a nM
Citation Ohshima, ETakami, HSato, HMohri, SObase, HMiki, IIshii, AShirakura, SKarasawa, AKubo, K Non-prostanoid thromboxane A2 receptor antagonists with a dibenzoxepin ring system. 2. J Med Chem35:3402-13 (1992) Thromboxane A2 receptor
Name:Thromboxane A2 receptor
Type:Enyzme
Mol. Mass.:37445.28
Organism:Homo sapiens (Human)
Description:P21731
Residue:343
BDBM50002778
NameBDBM50002778
Synonyms:11-[2-(5-Nitro-benzoimidazol-1-yl)-ethylidene]-6,11-dihydro-dibenzo[b,e]oxepine-2-carboxylic acid (0.2H2O) | CHEMBL424621
TypeSmall organic molecule
Emp. Form.C24H17N3O5
Mol. Mass.427.4089
SMILESOC(=O)c1ccc2OCc3ccccc3\C(=C/Cn3cnc4cc(ccc34)[N+]([O-])=O)c2c1