Reaction Details
TargetCoagulation factor X
LigandBDBM50242360
Substrate/Competitorn/a
Meas. Tech.ChEMBL_1671573 (CHEMBL4021602)
Ki 5800±n/a nM
Citation Wurtz, NRParkhurst, BLDeLucca, IGlunz, PWJiang, WZhang, XCheney, DLBozarth, JMRendina, ARWei, AHarper, TLuettgen, JMWu, YWong, PCSeiffert, DAWexler, RRPriestley, ES Neutral macrocyclic factor VIIa inhibitors. Bioorg Med Chem Lett27:2650-2654 (2017) 
 
Coagulation factor X
Name:Coagulation factor X
Type:Enzyme
Mol. Mass.:54726.60
Organism:Homo sapiens (Human)
Description:n/a
Residue:488
BDBM50242360
NameBDBM50242360
Synonyms:CHEMBL4069575
TypeSmall organic molecule
Emp. Form.C31H36N4O6S
Mol. Mass.592.706
SMILESCCc1cc2ccc1CCOC(=O)Nc1ccc(c(CN(C)C(=O)[C@@H]2Nc2cccc(c2)C(N)=O)c1)S(=O)(=O)C(C)C